{"text_format":"3","workbook":"xlsx","n_sheets":6,"sheets":["DATOS","Listado CNAE-2009","Auxiliar","PI 6","PI 1-2-3","PI 4-5"],"not_rendered":{"images":1,"macros":1,"defined_names":2,"comments":1},"read":"whole","date_system":"1900"}

{"sheet":"DATOS","index":0,"n_rows":65,"n_cols":4,"rows_kept":65,"merged":[[8,1,8,3],[11,1,11,2],[20,1,20,2],[23,3,24,3],[31,1,31,3],[37,1,37,2],[47,3,48,3],[49,1,49,3],[55,1,55,2],[62,1,62,3]]}
{"$rows_empty":8}
[null,"Herramienta de ayuda para cumplimentar las solicitudes de subvención acogidas al Decreto 145/2021 de 21 de diciembre, y MODIFICACIÓN POSTERIOR\nLos datos obtenidos en el uso de esta herramienta tienen carácter meramente informativo, sin que en ningún caso pueda derivarse efecto jurídico vinculante alguno con esta administración."]
[]
[null,null,"Introducir o seleccionar datos solamente en las celdas amarillas"]
[null,"DATOS DE ENTRADA",null,"Observaciones"]
[null,"Tipo de instalación para la que solicita la ayuda",null,"Elegir opción"]
[null,"Tipo de solicitante",null,{"$f":"IF(C14=\"\",\"Elegir opción\",VLOOKUP(C14,Auxiliar!R32:S56,2,FALSE))","v":"Elegir opción"}]
[null,{"$f":"IF(D15=\"No aplicable\",\"NO RELLENAR: Dato correspondiente a otro programa de incentivos\",IF(C14=\"Profesional Autónomo\",\"¿La instalación es en una ubicación DISTINTA a su VIVIENDA?\",\"¿Realiza actividad económica?\"))","v":"¿Realiza actividad económica?"},null,{"$f":"IF(OR(C14=Auxiliar!R23,C14=Auxiliar!R26),\"No aplicable\",\"Elegir opción\")","v":"Elegir opción"}]
[null,{"$f":"IF(D16=\"No aplicable\",\"NO RELLENAR: Dato correspondiente a otro programa de incentivos\",\"¿Actúa el solicitante en representación de agrupaciones de personas físicas o jurídicas propietarias de\ninstalaciones del sector servicios u otros sectores productivos?\")","v":"NO RELLENAR: Dato correspondiente a otro programa de incentivos"},null,{"$f":"IF(OR(D14=Auxiliar!S39,D14=Auxiliar!S44),\"Elegir opción\",\"No aplicable\")","v":"No aplicable"}]
[null,{"$f":"IF(D17=\"No aplicable\",\"NO RELLENAR: Dato correspondiente a otro programa de incentivos\",\"Grupo de CNAE (2009)\")","v":"Grupo de CNAE (2009)"},null,{"$f":"IF(C18=\"No se cumplen las condiciones\",\"Elegir Grupo de CNAE\",IF(OR(Auxiliar!W26=456,Auxiliar!V26=456,D14=\"Sector Institucional\"),\"No aplicable\",IF(AND(Auxiliar!Y26=0,OR(C18=4,C18=5,C18=6)),\"CNAE CORRECTO\",IF(AND(Auxiliar!Y26=23,OR(C18=2,C18=3)),\"CNAE CORRECTO\",IF(AND(Auxiliar!Y26=13,OR(C18=1,C18=3,C14=\"Entidades u organizaciones públicas o privadas, sin ánimo de lucro\")),\"CNAE CORRECTO\",\"CNAE INCORRECTO\")))))","v":"Elegir Grupo de CNAE"}]
[null,"PROGRAMA DE INCENTIVOS AL QUE ACOGERSE:",{"$f":"Auxiliar!Z27","v":"No se cumplen las condiciones"},{"$f":"IF(AND(OR(C14=Auxiliar!R9,C14=Auxiliar!R27),DATOS!C18=6),\"Acreditar viviendas sociales\",\"\")","v":""}]
[null,{"$f":"IF(OR(C18=4,C18=5,C18=6),\"¿Recupera IVA?\",\"NO RELLENAR: Dato correspondiente a otro programa de incentivos\")","v":"NO RELLENAR: Dato correspondiente a otro programa de incentivos"},null,{"$f":"IF(OR(C18=4,C18=5,C18=6),IF(C19=\"NO\",\"Incluir IVA en los COSTES\",\"No incluir IVA en los COSTES\"),\"No aplicable\")","v":"No aplicable"}]
[]
[null,{"$f":"IF(OR(DATOS!C18=1,DATOS!C18=2,DATOS!C18=3),\"PROGRAMA DE INCENTIVOS 1-2-3\",\"NO UTILIZAR ESTE APARTADO PARA EL PROGRAMA DE INCENTIVOS SELECCIONADO\")","v":"NO UTILIZAR ESTE APARTADO PARA EL PROGRAMA DE INCENTIVOS SELECCIONADO"},null,{"$f":"IF(OR(C18=4,C18=5,C18=6,C18=\"No se cumplen las condiciones\"),\"Notas\",\"Observaciones\")","v":"Notas"}]
[null,{"$f":"IF(OR(C18=4,C18=5,C18=6,C18=\"No se cumplen las condiciones\"),\"NO RELLENAR: Dato correspondiente a otro programa de incentivos\",\"Localidad\")","v":"NO RELLENAR: Dato correspondiente a otro programa de incentivos"},null,{"$f":"IF(OR(C18=3,C18=4,C18=5,C18=6,C18=\"No se cumplen las condiciones\"),\"\",'PI 1-2-3'!E6&\" aplica ayuda adicional por Población\")","v":""}]
{"$rows_left_out":44}
{"sheet":"Listado CNAE-2009","index":1,"n_rows":1011,"n_cols":3,"rows_kept":1011}
["COD_CNAE2009","CODINTEGR","TITULO_CNAE2009"]
["A","A","Agricultura, ganadería, silvicultura y pesca"]
[1,"A01","Agricultura, ganadería, caza y servicios relacionados con las mismas"]
[11,"A011","Cultivos no perennes"]
[111,"A0111","Cultivo de cereales (excepto arroz), leguminosas y semillas oleaginosas"]
[112,"A0112","Cultivo de arroz"]
[113,"A0113","Cultivo de hortalizas, raíces y tubérculos"]
[114,"A0114","Cultivo de caña de azúcar"]
[115,"A0115","Cultivo de tabaco"]
[116,"A0116","Cultivo de plantas para fibras textiles"]
[119,"A0119","Otros cultivos no perennes"]
[12,"A012","Cultivos perennes"]
[121,"A0121","Cultivo de la vid"]
[122,"A0122","Cultivo de frutos tropicales y subtropicales"]
[123,"A0123","Cultivo de cítricos"]
{"$rows_left_out":997}
{"sheet":"Auxiliar","index":2,"n_rows":1011,"n_cols":38,"rows_kept":1011,"hidden":true,"merged":[[0,17,0,28],[0,30,0,33],[1,27,1,28],[1,31,1,33],[2,31,2,33],[3,31,3,33],[4,21,7,22],[4,31,4,33],[5,31,5,33],[6,31,6,33],[7,31,7,33],[8,31,8,33],[9,31,9,33],[10,31,10,33],[11,31,11,33],[12,31,12,33],[13,31,13,33],[14,31,14,33],[15,31,15,33],[16,31,16,33],[17,31,17,33],[18,31,18,33],[19,31,19,33],[20,31,20,33],[21,31,21,33],[22,31,22,33],[23,21,23,26],[23,31,23,33],[24,31,24,33],[25,5,26,5],[25,6,26,6],[25,31,25,33],[26,7,26,9],[26,21,26,24],[26,31,26,33],[27,5,30,5],[27,31,27,33],[28,31,28,33],[29,31,29,33],[30,31,30,33],[31,5,33,5],[31,31,31,33],[32,31,32,33],[33,31,33,33],[34,7,34,10],[34,31,34,33],[35,5,38,5],[35,31,35,33],[36,31,36,33],[37,31,37,33],[38,31,38,33],[39,5,40,5],[39,6,40,6],[39,31,39,33],[40,7,40,9],[40,31,40,33],[41,5,44,5],[41,31,41,33],[42,31,42,33],[43,31,43,33],[44,31,44,33],[45,5,47,5],[48,7,48,9],[49,5,52,5],[49,12,55,12],[49,13,55,13],[53,5,55,5],[56,7,56,10],[57,5,60,5],[61,5,62,5],[61,6,62,6],[62,7,62,9],[72,7,72,9],[82,7,82,9],[83,5,83,9],[84,5,84,9],[85,5,85,9],[86,5,86,9]]}
["CP","Municipio","Población 2020","RETO DEMOGRÁFICO",null,"Situación expediente",{"$nulls":3},"DATOS","Distribución","Desmantelamiento","Categoría\nde empresa","Efectivos","Volumen de\nnegocio","Balance general",null,"CÁLCULO DEL PROGRAMA  DE INCENTIVOS",{"$nulls":12},"CHECK LIST",{"$nulls":4},"COD_CNAE2009","CODINTEGR","TITULO_CNAE2009"]
[6001,"Acedera",826,"RETO  < 5.000",null,"Anulado",{"$nulls":3},"SI","NO","NO","Grande",">250",">50.000.000 €",">43.000.000 €",null,"Lista Beneficiarios","Posible\npograma","¿Realiza actividad\neconómica?","Posible\npograma","¿En representación\nde otros?","Posible\npograma","Lista\nCNAE","Posible\nprograma","Tipo de instalación","Posible\nprograma","SUMA",{"$nulls":3},"Presupuesto l) <4%, 3.000€",{"$nulls":3},"A","A","Agricultura, ganadería, silvicultura y pesca"]
[6002,"Aceuchal",">5.000",">5.000",null,"C-Solicitud",{"$nulls":3},"NO","Suelo Radiante","Solar","Mediana",250,{"v":50000000,"d":"50,000,000 €"},{"v":43000000,"d":"43,000,000 €"},null,"Empresa de servicios energéticos",123,"SI",123,"SI",123456,"Dato no necesario",0,"Fotovoltaica sin almacenamiento",124,{"$f":"S3+U3+Y10+AA3","v":383},1,null,null,"Presupuesto l)+m)+n) <7%, 7.000€",{"$nulls":3},1,"A01","Agricultura, ganadería, caza y servicios relacionados con las mismas"]
[6003,"Ahillones",863,"RETO  < 5.000",null,"C-Subsanación",{"$nulls":4},"Radiadores","Biomasa","Pequeña",50,{"v":10000000,"d":"10,000,000 €"},{"v":10000000,"d":"10,000,000 €"},null,"Proveedor de servicios energéticos",123,"NO",456,"NO",23456,"A01 (excepto A17)",23,"Eólica sin almacenamiento",124,{"$f":"S9+U3+Y10+AA3","v":123717},1,null,null,"RESIDUOS",{"$nulls":3},11,"A011","Cultivos no perennes"]
[6004,"Alange",{"v":1856,"d":"1,856"},"RETO  < 5.000",null,"C-Completo",{"$nulls":4},"Sector",{"$nulls":6},"Empresa explotadora/arrendataria/concesionaria",123,null,null,"SOLO PARA:\n-Administración\n-Sector Industrial",null,"B",23,"Fotovoltaica con almacenamiento",124,{"$f":"S10+U3+W3+Y10+AA3","v":247172},1,null,null,"GASTOS NO SUBVENCIONABLES (Art. 7)",{"$nulls":3},111,"A0111","Cultivo de cereales (excepto arroz), leguminosas y semillas oleaginosas"]
[6005,"La Albuera",{"v":2035,"d":"2,035"},"RETO  < 5.000",null,"C-Prop. Prov. Concesión",{"$nulls":4},"Sector Residencial",{"$nulls":6},"Gestor de polígono industriales",123,{"$nulls":4},"C",23,"Eólica con almacenamiento",124,{"$f":"S24+U3+Y10+AA3","v":12605},1,null,null,"Documentación general",{"$nulls":3},112,"A0112","Cultivo de arroz"]
[6006,"Alburquerque",">5.000",">5.000",null,"C-Prop. Prov. Denegación",{"$nulls":4},"Administraciones públicas",{"$nulls":6},"Agrupación personas físicas",123,{"$nulls":4},"D",23,"Incorporación de almacenamiento",35,{"$f":"S22+U3+Y10+AA3","v":123718},1,null,null,"Escritura de apoderamiento.",{"$nulls":3},113,"A0113","Cultivo de hortalizas, raíces y tubérculos"]
[6007,"Alconchel",{"v":1659,"d":"1,659"},"RETO  < 5.000",null,"C-Prop. Def. Concesión",{"$nulls":4},"Tercer sector (ONG)",{"$nulls":6},"Agrupación de empresas",123,{"$nulls":4},"E",23,"Aerotermia aire-agua (Climatización y/o ACS)",6,{"$f":"S3+U3+Y4+AA3","v":393},2,null,null,"Memoria técnica.",{"$nulls":3},114,"A0114","Cultivo de caña de azúcar"]
[6008,"Alconera",743,"RETO  < 5.000",null,"C-Resol. Concesión",{"$nulls":4},"Otro sector (agropecuario, etc)",{"$nulls":6},"Otros tipos de empresas (personas jurídicas)",123457,6,{"$nulls":3},"F",23,"Solar Térmica",6,{"$f":"S9+U3+Y4+AA3","v":123727},2,null,null,"Presupuesto de la empresa.",{"$nulls":3},115,"A0115","Cultivo de tabaco"]
[6009,"Aljucén",250,"RETO  < 5.000",null,"C-Resol. Inadmisión",{"$nulls":11},"Municipio o Ayuntamiento",123456,{"$nulls":4},"G",13,"Biomasa caldera",6,{"$f":"S10+U3+W3+Y4+AA3","v":247182},2,null,null,"DR no afectación medioambiental.",{"$nulls":3},116,"A0116","Cultivo de plantas para fibras textiles"]
[6010,"Almendral",{"v":1239,"d":"1,239"},"RETO  < 5.000",null,"C-Resol. Denegación",{"$nulls":11},"Entidad local menor",123456,{"$nulls":4},"H",13,"Biomasa aparatos de calefacción local",6,{"$f":"S10+U3+W4+Y4+AA3","v":147182},2,null,null,"P>100KW - Plan estratégico.",{"$nulls":3},119,"A0119","Otros cultivos no perennes"]
[6011,"Almendralejo",">5.000",">5.000",null,"C-Resol. Desistimiento",{"$nulls":11},"Mancomunidad de municipios",123456,{"$nulls":4},"I",13,"Geotermica de circuito cerrado",6,{"$f":"S24+U3+Y4+AA3","v":12615},2,null,null,"P>100KW - Justificación no causar daño medioambiental.",{"$nulls":3},12,"A012","Cultivos perennes"]
[6012,"Arroyo de San Serván",{"v":4080,"d":"4,080"},"RETO  < 5.000",null,"C-Resol. Renuncia",{"$nulls":11},"Diputación provincial",123456,{"$nulls":4},"J",13,"Geotermica o Hidrotérmica de circuito abierto",6,{"$f":"S27+U3+Y4+AA3","v":23728},2,null,null,"P>100KW - Memoria resumen RESIDUOS DE CONSTRUCCIÓN LER.",{"$nulls":3},121,"A0121","Cultivo de la vid"]
[6013,"Atalaya",294,"RETO  < 5.000",null,"L- Solicitud",{"$nulls":11},"Otras entidades locales",123456,{"$nulls":4},"K",13,null,null,{"$f":"S22+U3+Y4+AA3","v":123728},2,null,null,"DR incl. SOLICITUD - Pago obligaciones por reintegro de subvenciones.",{"$nulls":3},122,"A0122","Cultivo de frutos tropicales y subtropicales"]
[6014,"Azuaga",">5.000",">5.000",null,"L- Subsanación",{"$nulls":11},"Organismo público o entidad de derecho público vinculados o dependientes administración Pública Local",123456,{"$nulls":4},"L",13,null,null,{"$f":"S27+U3+Y10+AA3","v":23718},2,null,null,"DR incl. SOLICITUD - No ha recibido ayuda anterior para la misma actuación.",{"$nulls":3},123,"A0123","Cultivo de cítricos"]
{"$rows_left_out":997}
{"sheet":"PI 6","index":3,"n_rows":12,"n_cols":6,"rows_kept":12,"hidden":true,"merged":[[1,1,1,4],[2,1,2,4],[11,1,11,2]]}
[]
[null,{"$f":"IF(OR(DATOS!C18=6),\"PROGRAMA DE INCENTIVOS 6\",\"NO UTILIZAR ESTA HOJA PARA EL CÁLCULO\")","v":"NO UTILIZAR ESTA HOJA PARA EL CÁLCULO"}]
[null,"DATOS DE ENTRADA"]
[null,"Ps: Potencia instalación de TÉRMICA (kW)",{"$f":"DATOS!C58","v":{"v":0,"d":"0.00"}},"¿Sector?",{"$f":"DATOS!C57","v":0},{"$f":"IF(DATOS!C13=Auxiliar!Z8,\"F1\",IF(DATOS!C13=Auxiliar!Z10,\"F6\",IF(DATOS!C13=Auxiliar!Z11,\"F7\",IF(DATOS!C13=Auxiliar!Z12,\"F8\",IF(DATOS!C13=Auxiliar!Z13,\"F9\",IF(AND(DATOS!C13=Auxiliar!Z9,C4>400),\"F2\",IF(AND(DATOS!C13=Auxiliar!Z9,C4<=400,C4>100),\"F3\",IF(AND(DATOS!C13=Auxiliar!Z9,C4<=100,C4>50),\"F4\",IF(AND(DATOS!C13=Auxiliar!Z9,C4<=50),\"F5\",\"No aplica\")))))))))","v":"No aplica"}]
[null,"Ceg: Inversión en inst. TÉRMICA+COMPL. (sin IVA)",{"$f":"DATOS!C59","v":{"v":0,"d":"0.00 €"}},"¿Se realiza Nueva Distribución Interior?",{"$f":"DATOS!C60","v":0},{"$f":"IF(OR(DATOS!C13=Auxiliar!Z8,DATOS!C13=Auxiliar!Z9,DATOS!C13=Auxiliar!Z12,DATOS!C13=Auxiliar!Z13),\"Aplica\",\"No aplica por tipo de instalación\")","v":"No aplica por tipo de instalación"}]
[null,"Ceug: coste elegible unitario GEN. (sin IVA)",{"$f":"IF(DATOS!C18=6,C5/C4,0)","v":{"v":0,"d":"0.00 €"}},"¿Se Desmantela instalación existente?",{"$f":"DATOS!C61","v":0},{"$f":"IF(AND(OR(DATOS!C13=Auxiliar!Z9,DATOS!C13=Auxiliar!Z10,DATOS!C13=Auxiliar!Z11),E6=\"SI\"),\"Aplica\",\"No aplica por tipo de instalación\")","v":"No aplica por tipo de instalación"}]
[null,"Módulo GENERACIÓN (€/kWp)",{"$f":"IF(E4=\"Sector Residencial\",VLOOKUP(F4,Auxiliar!G64:L72,5,FALSE),VLOOKUP(F4,Auxiliar!G74:L82,5,FALSE))","v":{"$error":"#N/A"}},"Número de viviendas que utilizarán la instalación",{"$f":"DATOS!C62","v":0}]
[null,"Módulo COMPLEMENTARIO (€/kWp)",{"$f":"IF(OR(E5=\"NO\",E5=0),0,IF(AND(E5=\"Radiadores\",F5=\"SI\"),Auxiliar!K85,IF(F5=\"No aplica por tipo de instalación\",0,Auxiliar!K84)))+IF(AND(DATOS!C13=Auxiliar!Z9,E6=\"SI\"),Auxiliar!K86,IF(AND(E6=\"SI\",OR(DATOS!C13=Auxiliar!Z10,DATOS!C13=Auxiliar!Z11)),Auxiliar!K87,0))","v":{"v":0,"d":"0.00 €"}},"Valor de Ayuda máximo GENERACIÓN (€/vivienda)",{"$f":"IF(E4=\"Sector Residencial\",VLOOKUP(F4,Auxiliar!G64:L72,6,FALSE),VLOOKUP(F4,Auxiliar!G74:L82,6,FALSE))","v":{"$error":"#N/A"}}]
[null,"Coste subv. unit. máx. TOTAL GEN. (€/kWp)",{"$f":"C7+C8","v":{"$error":"#N/A"}},"Valor de Ayuda máximo COMPLEMENTARIO (€/vivienda)",{"$f":"IF(E5=\"NO\",0,IF(AND(E5=\"Radiadores\",F5=\"SI\"),Auxiliar!L85,IF(F5=\"No aplica por tipo de instalación\",0,Auxiliar!L84)))+IF(AND(DATOS!C13=Auxiliar!Z9,E6=\"SI\"),Auxiliar!L86,IF(AND(E6=\"SI\",OR(DATOS!C13=Auxiliar!Z10,DATOS!C13=Auxiliar!Z11)),Auxiliar!L87,0))","v":{"v":0,"d":"0.00 €"}}]
[null,"Coste subv. unit. FINAL de GENERACIÓN (€/kWp)",{"$f":"IF(DATOS!C18=6,MIN(C6,C9),0)","v":{"v":0,"d":"0.00 €"}}]
[null,"Ayuda Total en GENERACIÓN",{"$f":"C10*C4","v":{"v":0,"d":"0.00 €"}},"Valor de Ayuda MÁXIMO (€/vivienda)",{"$f":"SUM(E8:E9)","v":{"$error":"#N/A"}}]
[null,"AYUDA TOTAL",null,{"$f":"IF(E4=\"Otro sector (agropecuario, etc)\",\"No subvencionable\",MIN(C11,E11))","v":{"$error":"#N/A"}},{"$f":"IF(E4=\"Otro sector (agropecuario, etc)\",\"No aplica\",D12/C5)","v":{"$error":"#N/A"}}]

{"sheet":"PI 1-2-3","index":4,"n_rows":17,"n_cols":6,"rows_kept":17,"hidden":true,"merged":[[1,1,1,4],[2,1,2,2],[2,3,2,4],[16,1,16,2]]}
[]
[null,{"$f":"IF(OR(DATOS!C18=1,DATOS!C18=2,DATOS!C18=3),\"PROGRAMA DE INCENTIVOS 1-2-3\",\"NO UTILIZAR ESTA HOJA PARA EL CÁLCULO\")","v":"NO UTILIZAR ESTA HOJA PARA EL CÁLCULO"}]
[null,"DATOS DE GENERACIÓN",null,"DATOS DE ALMACENAMIENTO"]
[null,"Ps: Potencia instalación de GENERACIÓN(kWp)",{"$f":"IF(DATOS!C18=3,0,IF(DATOS!C28>5000,5000,DATOS!C28))","v":{"v":0,"d":"0.00"}},"Localidad",{"$f":"DATOS!C22","v":0}]
[null,"Ceg: Inversión en GENERACIÓN+COMPL. (sin IVA)",{"$f":"DATOS!C29","v":{"v":0,"d":"0.00 €"}},"RETO DEMOGRÁFICO",{"$f":"VLOOKUP(E4,Auxiliar!B2:D389,3,FALSE)","v":{"$error":"#N/A"}}]
[null,"Ceug: coste elegible unitario GEN. (sin IVA)",{"$f":"IF(DATOS!C18=3,0,C5/C4)","v":{"$error":"#DIV/0!"}},"¿Se aplica la ayuda adicional por Población?",{"$f":"IF(E5=\"RETO  < 5.000\",\"SI\",\"NO\")","v":{"$error":"#N/A"}}]
[null,"Cuf: coste unitario inst. REFERENCIA (Anexo III)",{"$f":"VLOOKUP(F15,Auxiliar!$G$28:$P$34,5,FALSE)","v":{"v":86,"d":"86.00 €"}},"Tipo de empresa",{"$f":"IF(AND(DATOS!C23<Auxiliar!N4,OR(DATOS!C24<Auxiliar!O4,DATOS!C25<Auxiliar!P4)),\"Pequeña\",IF(AND(DATOS!C23<Auxiliar!N3,OR(DATOS!C24<Auxiliar!O3,DATOS!C25<Auxiliar!P3)),\"Mediana\",\"Grande\"))","v":"Pequeña"},{"$f":"IF(E7=\"Grande\",8,IF(E7=\"Mediana\",9,10))","v":10}]
[null,"Csug: coste subvencionable unitario GEN.",{"$f":"IF((C6-C7)<0,0,C6-C7)","v":{"$error":"#DIV/0!"}},"Cap: Capaciad de ALMACENAMIENTO (kWh)",{"$f":"DATOS!C30","v":{"v":0,"d":"0.00"}}]
[null,"Csumg: coste subv. unit. máx. GENERACIÓN",{"$f":"VLOOKUP(F15,Auxiliar!$G$28:$P$34,6,FALSE)","v":{"v":4723,"d":"4,723.00 €"}},"Cea: Inversión en ALMACENAMIENTO (sin IVA)",{"$f":"DATOS!C31","v":{"v":0,"d":"0.00 €"}}]
[null,"Csumcg 1: coste unit. máx. COMPL. Amianto",{"$f":"IF(OR(DATOS!C13=Auxiliar!Z3,DATOS!C13=Auxiliar!Z5),IF(DATOS!C26=\"SI\",VLOOKUP(F15,Auxiliar!$G$28:$P$34,7,FALSE),0),0)","v":{"v":0,"d":"0.00 €"}},"¿Se cumple el ratio ALMACENAMIENTO/GENERACIÓN?",{"$f":"IF(E8/DATOS!C28>5,\"NO\",\"SI\")","v":{"$error":"#DIV/0!"}}]
[null,"Csumcg 2: coste unit. máx. COMPL. Marquesina",{"$f":"IF(OR(DATOS!C13=Auxiliar!Z3,DATOS!C13=Auxiliar!Z5),IF(DATOS!C27=\"SI\",500,0),0)","v":{"v":0,"d":"0.00 €"}},"Csua=Ceua: coste subvencionable unitario ALM.",{"$f":"IF(E12=0,0,E9/E8)","v":{"$error":"#DIV/0!"}}]
[null,"Csumtg: coste subv. unit. máx. TOTAL GEN.",{"$f":"SUM(C9:C11)","v":{"v":4723,"d":"4,723.00 €"}},"Csumta: coste subv. unit. máx. ALMACENAMIENTO",{"$f":"IF(OR(DATOS!C13=Auxiliar!Z3,DATOS!C13=Auxiliar!Z4),0,VLOOKUP(F12,Auxiliar!$G$36:$P$39,6,FALSE))","v":{"v":700,"d":"700.00 €"}},{"$f":"IF(E8=\"\",\"\",IF(E8<=10,Auxiliar!G39,IF(AND(E8>10,E8<=100),Auxiliar!G38,IF(AND(E8>100,E8<=5000),Auxiliar!G37,Auxiliar!G36))))","v":"F11"}]
[null,"Csufg: coste subv. unit. FINAL de GEN. (€/kWp)",{"$f":"IF(DATOS!C18=3,0,MIN(C8,C12))","v":{"$error":"#DIV/0!"}},"Csufa: coste subv. unit. FINAL de ALM. (€/kWp)",{"$f":"IF(E10=\"NO\",0,MIN(E11,E12))","v":{"$error":"#DIV/0!"}}]
[null,"Cstg: coste subvencionable total GEN. (€/kWp)",{"$f":"C13*C4","v":{"$error":"#DIV/0!"}},"Csta: coste subvencionable total ALM. (€/kWp)",{"$f":"E13*E8","v":{"$error":"#DIV/0!"}}]
[null,"Porcentaje de Ayuda en GENERACIÓN",{"$f":"IF(DATOS!C18=3,0,VLOOKUP(F15,Auxiliar!G28:P34,F7,FALSE)+IF(E5=\"RETO  < 5.000\",0.05,0))","v":{"$error":"#N/A"}},"Porcentaje de Ayuda en ALMACENAMIENTO",{"$f":"IF(E8=\"\",0,VLOOKUP(F12,Auxiliar!G36:P39,F7,FALSE))","v":{"v":0.65,"d":"65%"}},{"$f":"IF(OR(DATOS!C13=Auxiliar!Z3,DATOS!C13=Auxiliar!Z5),IF(C4<=10,Auxiliar!G31,IF(AND(C4>10,C4<=100),Auxiliar!G30,IF(AND(C4>100,C4<=1000),Auxiliar!G29,Auxiliar!G28))),IF(C4<=20,Auxiliar!G34,IF(AND(C4>20,C4<=500),Auxiliar!G33,IF(AND(C4>500,C4<=5000),Auxiliar!G32,Auxiliar!G32))))","v":"F7"}]
{"$rows_left_out":3}
{"sheet":"PI 4-5","index":5,"n_rows":16,"n_cols":6,"rows_kept":16,"hidden":true,"merged":[[1,1,1,4],[2,1,2,2],[2,3,2,4],[15,1,15,2]]}
[]
[null,{"$f":"IF(OR(DATOS!C18=4,DATOS!C18=5),\"PROGRAMA DE INCENTIVOS 4-5\",\"NO UTILIZAR ESTA HOJA PARA EL CÁLCULO\")","v":"NO UTILIZAR ESTA HOJA PARA EL CÁLCULO"}]
[null,"DATOS DE GENERACIÓN",null,"DATOS DE ALMACENAMIENTO"]
[null,"¿Sector?",{"$f":"DATOS!C40","v":0},"Localidad",{"$f":"DATOS!C39","v":0}]
[null,"¿Autoconsumo colectivo?",{"$f":"DATOS!C41","v":0},"RETO DEMOGRÁFICO",{"$f":"VLOOKUP(E4,Auxiliar!B2:D389,3,FALSE)","v":{"$error":"#N/A"}},{"$f":"IF(C5=\"NO\",5,6)","v":6}]
[{"$nulls":3},"¿Se aplica la ayuda adicional por Población?",{"$f":"IF(E5=\"RETO  < 5.000\",\"SI\",\"NO\")","v":{"$error":"#N/A"}}]
[null,"Ps: Potencia instalación de GENERACIÓN(kWp)",{"$f":"IF(DATOS!C18=5,0,IF(DATOS!C44>5000,5000,DATOS!C44))","v":0},"Cap: Capaciad de ALMACENAMIENTO (kWh)",{"$f":"DATOS!C46","v":{"v":0,"d":"0.00"}}]
[null,"Ceg: Inversión en GENERACIÓN+COMPL. (sin IVA)",{"$f":"DATOS!C45","v":{"v":0,"d":"0.00 €"}},"Cea: Inversión en ALMACENAMIENTO (sin IVA)",{"$f":"DATOS!C47","v":{"v":0,"d":"0.00 €"}}]
[null,"Ceug: coste elegible unitario GEN. (sin IVA)",{"$f":"IF(DATOS!C18=5,0,C8/C7)","v":{"$error":"#DIV/0!"}},"Ceua: coste subvencionable unitario ALM. (sin IVA)",{"$f":"IF(E10=0,0,E8/E7)","v":{"$error":"#DIV/0!"}}]
[null,"Módulo de GENERACIÓN (€/kWp)",{"$f":"IF(C4=\"Sector Residencial\",VLOOKUP(F14,Auxiliar!$G$42:$N$48,F5,FALSE),VLOOKUP(F14,Auxiliar!$G$50:$N$56,F5,FALSE))","v":{"v":4550,"d":"4,550.00 €"}},"Módulo de ALMACENAMIENTO (€/kWp)",{"$f":"IF(OR(DATOS!C13=Auxiliar!Z3,DATOS!C13=Auxiliar!Z4),0,VLOOKUP(F10,Auxiliar!$G$58:$N$61,6,FALSE))","v":{"v":490,"d":"490.00 €"}},{"$f":"IF(E7=\"\",\"\",IF(E7<=10,\"F11\",IF(AND(E7>10,E7<=100),\"F10\",IF(AND(E7>100,E7<=5000),\"F9\",\"F8\"))))","v":"F11"}]
[null,"Módulo complementario (€/kWp)",{"$f":"IF(DATOS!C42=\"SI\",VLOOKUP(F14,Auxiliar!$G$42:$N$48,7,FALSE),0)+IF(OR(DATOS!C13=Auxiliar!Z3,DATOS!C13=Auxiliar!Z5),IF(DATOS!C43=\"SI\",120,0),0)","v":{"v":0,"d":"0.00 €"}},"¿Se cumple el ratio ALMACENAMIENTO/GENERACIÓN?",{"$f":"IF(E7/DATOS!C44>5,\"NO\",\"SI\")","v":{"$error":"#DIV/0!"}}]
[null,"Módulo adicional GENERACIÓN (€/kWp)",{"$f":"IF(E5=\"RETO  < 5.000\",VLOOKUP(F14,Auxiliar!$G$42:$N$48,8,FALSE),0)","v":{"$error":"#N/A"}},"Módulo adicional ALMACENAMIENTO (€/kWp)",{"$f":"IF(E5=\"RETO  < 5.000\",15,0)","v":{"$error":"#N/A"}}]
[null,"Coste subv. unit. máx. TOTAL GEN. (€/kWp)",{"$f":"C10+C11+C12","v":{"$error":"#N/A"}},"Coste subv. unit. máx. TOTAL ALM. (€/kWp)",{"$f":"E10+E12","v":{"$error":"#N/A"}}]
[null,"Coste subv. unit. FINAL de GENERACIÓN (€/kWp)",{"$f":"IF(DATOS!C18=5,0,MIN(C9,C13))","v":{"$error":"#DIV/0!"}},"Coste subv. unit. FINAL de ALMACENAMIENTO (€/kWp)",{"$f":"IF(E11=\"NO\",0,MIN(E13,E9))","v":{"$error":"#DIV/0!"}},{"$f":"IF(OR(DATOS!C13=Auxiliar!Z3,DATOS!C13=Auxiliar!Z5),IF(C7<=10,Auxiliar!G45,IF(AND(C7>10,C7<=100),Auxiliar!G44,IF(AND(C7>100,C7<=1000),Auxiliar!G43,Auxiliar!G42))),IF(C7<=20,Auxiliar!G48,IF(AND(C7>20,C7<=500),Auxiliar!G47,IF(AND(C7>500,C7<=5000),Auxiliar!G46,Auxiliar!G46))))","v":"F7"}]
[null,"Ayuda Total en GENERACIÓN",{"$f":"C14*C7","v":{"$error":"#DIV/0!"}},"Ayuda Total en ALMACENAMIENTO",{"$f":"E14*E7","v":{"$error":"#DIV/0!"}}]
{"$rows_left_out":1}